Reaction Details
TargetAdenosylhomocysteinase
LigandBDBM50105903
Substrate/Competitorn/a
Meas. Tech.ChEMBL_1507791 (CHEMBL3598548)
IC50 600±n/a nM
Citation Nakao, ASuzuki, HUeno, HIwasaki, HSetsuta, TKashima, ASunada, S Discovery and structural analyses of S-adenosyl-L-homocysteine hydrolase inhibitors based on non-adenosine analogs. Bioorg Med Chem23:4952-69 (2015) 
 
Adenosylhomocysteinase
Name:Adenosylhomocysteinase
Type:PROTEIN
Mol. Mass.:47714.06
Organism:Homo sapiens (Human)
Description:ChEMBL_1507791
Residue:432
BDBM50105903
NameBDBM50105903
Synonyms:CHEMBL3597822
TypeSmall organic molecule
Emp. Form.C36H42Cl2N4O5
Mol. Mass.681.648
SMILESCN(C1Cc2ccccc2C1)C(=O)CN(CC(=O)NC[C@H]1CCCN1C(=O)OC(C)(C)C)c1cc(Cl)ccc1Oc1ccc(Cl)cc1