Reaction Details
TargetDelta-type opioid receptor
LigandBDBM50106355
Substrate/Competitorn/a
Meas. Tech.ChEMBL_1506598 (CHEMBL3598351)
Ki 18±n/a nM
Citation Nemoto, TIihara, YHirayama, SIwai, THigashi, EFujii, HNagase, H Naltrindole derivatives with fluorinated ethyl substituents on the 17-nitrogen asd opioid receptor inverse agonists. Bioorg Med Chem Lett25:2927-30 (2015) 
 
Delta-type opioid receptor
Name:Delta-type opioid receptor
Type:G Protein-Coupled Receptor (GPCR)
Mol. Mass.:40382.98
Organism:Homo sapiens (Human)
Description:Competition binding assays were carried out using membrane preparations from transfected HN9.10 cells that constitutively expressed the delta opioid receptor.
Residue:372
BDBM50106355
NameBDBM50106355
Synonyms:CHEMBL3596371
TypeSmall organic molecule
Emp. Form.C25H23ClF2N2O3
Mol. Mass.472.912
SMILESCl.[H][C@@]12Oc3c4c(C[C@@]5([H])N(CC(F)F)CC[C@@]14[C@@]5(O)Cc1cc4ccccc4nc21)ccc3O