Reaction Details
TargetSubstance-P receptor
LigandBDBM50108672
Substrate/Competitorn/a
Meas. Tech.ChEMBL_1506611 (CHEMBL3598468)
IC50 70±n/a nM
Citation Degnan, APTora, GOHan, YRajamani, RBertekap, RKrause, RDavis, CDHu, JMorgan, DTaylor, SJKrause, KLi, YWMattson, GCunningham, MATaber, MTLodge, NJBronson, JJGillman, KWMacor, JE Biaryls as potent, tunable dual neurokinin 1 receptor antagonists and serotonin transporter inhibitors. Bioorg Med Chem Lett25:3039-43 (2015) 
 
Substance-P receptor
Name:Substance-P receptor
Type:G Protein-Coupled Receptor (GPCR)
Mol. Mass.:46371.54
Organism:Rattus norvegicus (rat)
Description:Competition binding assays were carried out using membrane preparations from transfected CHO cells that constitutively expressed the rat NK1 receptor.
Residue:407
BDBM50108672
NameBDBM50108672
Synonyms:CHEMBL3596506
TypeSmall organic molecule
Emp. Form.C22H25N7O
Mol. Mass.403.4802
SMILESCOc1cccc2c3nc(CN4CCN(C[C@H]4C)c4ccccc4)nn3c(N)nc12