Reaction Details
TargetSubstance-P receptor
LigandBDBM50108640
Substrate/Competitorn/a
Meas. Tech.ChEMBL_1506611 (CHEMBL3598468)
IC50 87±n/a nM
Citation Degnan, APTora, GOHan, YRajamani, RBertekap, RKrause, RDavis, CDHu, JMorgan, DTaylor, SJKrause, KLi, YWMattson, GCunningham, MATaber, MTLodge, NJBronson, JJGillman, KWMacor, JE Biaryls as potent, tunable dual neurokinin 1 receptor antagonists and serotonin transporter inhibitors. Bioorg Med Chem Lett25:3039-43 (2015) 
 
Substance-P receptor
Name:Substance-P receptor
Type:G Protein-Coupled Receptor (GPCR)
Mol. Mass.:46371.54
Organism:Rattus norvegicus (rat)
Description:Competition binding assays were carried out using membrane preparations from transfected CHO cells that constitutively expressed the rat NK1 receptor.
Residue:407
BDBM50108640
NameBDBM50108640
Synonyms:CHEMBL3596449
TypeSmall organic molecule
Emp. Form.C22H27N5O2
Mol. Mass.393.4821
SMILESCOc1ccc(cc1COCC1(CCNCC1)c1ccccc1)-n1nnnc1C