Reaction Details
TargetCarbonic anhydrase 2
LigandBDBM26985
Substrate/Competitorn/a
Meas. Tech.ChEMBL_1507028 (CHEMBL3599982)
Ki 1500000±n/a nM
Citation Pinard, MALotlikar, SRBoone, CDVullo, DSupuran, CTPatrauchan, MAMcKenna, R Structure and inhibition studies of a type II beta-carbonic anhydrase psCA3 from Pseudomonas aeruginosa. Bioorg Med Chem23:4831-8 (2015) 
 
Carbonic anhydrase 2
Name:Carbonic anhydrase 2
Type:Enzyme
Mol. Mass.:29250.71
Organism:Homo sapiens (Human)
Description:P00918
Residue:260
BDBM26985
NameBDBM26985
Synonyms:2-triaza-1,2-diyne CHEMBL89295 azide
TypeIon
Emp. Form.N3
Mol. Mass.42.0206
SMILES[N-]=[N+]=[N-]