Reaction Details
TargetCarbonic anhydrase
LigandBDBM36130
Substrate/Competitorn/a
Meas. Tech.ChEMBL_1507030 (CHEMBL3599984)
pH8.3±n/a
Ki 920000±n/a nM
Commentsextracted
Citation Pinard, MALotlikar, SRBoone, CDVullo, DSupuran, CTPatrauchan, MAMcKenna, R Structure and inhibition studies of a type II beta-carbonic anhydrase psCA3 from Pseudomonas aeruginosa. Bioorg Med Chem23:4831-8 (2015) 
 
Carbonic anhydrase
Name:Carbonic anhydrase
Type:PROTEIN
Mol. Mass.:24220.80
Organism:Pseudomonas aeruginosa (strain ATCC 15692 / PAO1 / 1C / PRS 101 / LMG12228)
Description:ChEMBL_109845
Residue:215
BDBM36130
NameBDBM36130
Synonyms:CHEMBL181124 | sodium hexafluorophosphate
TypeGuest
Emp. Form.F6P
Mol. Mass.144.96473
SMILESF[P-](F)(F)(F)(F)F