Reaction Details
TargetCarbonic anhydrase 12
LigandBDBM50107371
Substrate/Competitorn/a
Meas. Tech.ChEMBL_1509206 (CHEMBL3602839)
Ki 3.9±n/a nM
Citation Khloya, PCeruso, MRam, SSupuran, CTSharma, PK Sulfonamide bearing pyrazolylpyrazolines as potent inhibitors of carbonic anhydrase isoforms I, II, IX and XII. Bioorg Med Chem Lett25:3208-12 (2015) 
 
Carbonic anhydrase 12
Name:Carbonic anhydrase 12
Type:Enzyme
Mol. Mass.:39456.00
Organism:Homo sapiens (Human)
Description:Catalytic domain of human cloned isozyme was used in the assay
Residue:354
BDBM50107371
NameBDBM50107371
Synonyms:CHEMBL3601463
TypeSmall organic molecule
Emp. Form.C21H19Cl2N5O3S
Mol. Mass.492.378
SMILESCC(=O)N1N=C(CC1c1c(C)nn(c1Cl)-c1ccc(cc1)S(N)(=O)=O)c1ccc(Cl)cc1