Reaction Details
TargetCarbonic anhydrase 9
LigandBDBM50107368
Substrate/Competitorn/a
Meas. Tech.ChEMBL_1509205 (CHEMBL3602838)
Ki 71±n/a nM
Citation Khloya, PCeruso, MRam, SSupuran, CTSharma, PK Sulfonamide bearing pyrazolylpyrazolines as potent inhibitors of carbonic anhydrase isoforms I, II, IX and XII. Bioorg Med Chem Lett25:3208-12 (2015) 
 
Carbonic anhydrase 9
Name:Carbonic anhydrase 9
Type:Enzyme
Mol. Mass.:49669.03
Organism:Homo sapiens (Human)
Description:Catalytic domain of human cloned isozyme was used in the assay
Residue:459
BDBM50107368
NameBDBM50107368
Synonyms:CHEMBL3601391
TypeSmall organic molecule
Emp. Form.C26H25ClN6O4S2
Mol. Mass.585.098
SMILESCc1nn(c(Cl)c1C1CC(=NN1c1ccc(cc1)S(N)(=O)=O)c1ccc(C)cc1)-c1ccc(cc1)S(N)(=O)=O