Reaction Details
TargetCarbonic anhydrase 12
LigandBDBM50107340
Substrate/Competitorn/a
Meas. Tech.ChEMBL_1509206 (CHEMBL3602839)
Ki 0.470000±n/a nM
Citation Khloya, PCeruso, MRam, SSupuran, CTSharma, PK Sulfonamide bearing pyrazolylpyrazolines as potent inhibitors of carbonic anhydrase isoforms I, II, IX and XII. Bioorg Med Chem Lett25:3208-12 (2015) 
 
Carbonic anhydrase 12
Name:Carbonic anhydrase 12
Type:Enzyme
Mol. Mass.:39456.00
Organism:Homo sapiens (Human)
Description:Catalytic domain of human cloned isozyme was used in the assay
Residue:354
BDBM50107340
NameBDBM50107340
Synonyms:CHEMBL3601395
TypeSmall organic molecule
Emp. Form.C25H22BrClN6O4S2
Mol. Mass.649.967
SMILESCc1nn(c(Cl)c1C1CC(=NN1c1ccc(cc1)S(N)(=O)=O)c1ccc(Br)cc1)-c1ccc(cc1)S(N)(=O)=O