Reaction Details
TargetAdenosine receptor A2a
LigandBDBM50108674
Substrate/Competitorn/a
Meas. Tech.ChEMBL_1506709 (CHEMBL3598725)
Ki 5.3±n/a nM
Citation Deng, QLim, YHAnand, RYu, YKim, JHZhou, WZheng, JTempest, PLevorse, DZhang, XGreene, SMullins, DCulberson, CSherborne, BParker, EMStamford, AAli, A Use of molecular modeling aided design to dial out hERG liability in adenosine A(2A) receptor antagonists. Bioorg Med Chem Lett25:2958-62 (2015) 
 
Adenosine receptor A2a
Name:Adenosine receptor A2a
Type:G Protein-Coupled Receptor (GPCR)
Mol. Mass.:44716.46
Organism:Homo sapiens (Human)
Description:P29274
Residue:412
BDBM50108674
NameBDBM50108674
Synonyms:CHEMBL3596504
TypeSmall organic molecule
Emp. Form.C22H24FN7O
Mol. Mass.421.4707
SMILESCOc1cccc2c3nc(CN4CCN(C[C@H]4C)c4cccc(F)c4)nn3c(N)nc12