Reaction Details
TargetNuclear receptor ROR-gamma
LigandBDBM50108775
Substrate/Competitorn/a
Meas. Tech.ChEMBL_1506714 (CHEMBL3598805)
EC50 12±n/a nM
Citation Chao, JEnyedy, IVan Vloten, KMarcotte, DGuertin, KHutchings, RPowell, NJones, HBohnert, TPeng, CCSilvian, LHong, VSLittle, KBanerjee, DPeng, LTaveras, AViney, JLFontenot, J Discovery of biaryl carboxylamides as potent ROR¿ inverse agonists. Bioorg Med Chem Lett25:2991-7 (2015) 
 
Nuclear receptor ROR-gamma
Name:Nuclear receptor ROR-gamma
Type:Enzyme Catalytic Domain
Mol. Mass.:58218.40
Organism:Homo sapiens (Human)
Description:P51449
Residue:518
BDBM50108775
NameBDBM50108775
Synonyms:CHEMBL3596638
TypeSmall organic molecule
Emp. Form.C25H24Cl2FN3O2
Mol. Mass.488.381
SMILESCCN(CC)c1cc(ccc1N(C)C(=O)c1c(F)cccc1Cl)-c1cc(ccc1Cl)C(N)=O