Reaction Details
TargetNuclear receptor ROR-gamma
LigandBDBM50108900
Substrate/Competitorn/a
Meas. Tech.ChEMBL_1506713 (CHEMBL3598804)
IC50 11±n/a nM
Citation Chao, JEnyedy, IVan Vloten, KMarcotte, DGuertin, KHutchings, RPowell, NJones, HBohnert, TPeng, CCSilvian, LHong, VSLittle, KBanerjee, DPeng, LTaveras, AViney, JLFontenot, J Discovery of biaryl carboxylamides as potent ROR¿ inverse agonists. Bioorg Med Chem Lett25:2991-7 (2015) 
 
Nuclear receptor ROR-gamma
Name:Nuclear receptor ROR-gamma
Type:Enzyme Catalytic Domain
Mol. Mass.:58218.40
Organism:Homo sapiens (Human)
Description:P51449
Residue:518
BDBM50108900
NameBDBM50108900
Synonyms:CHEMBL3596631
TypeSmall organic molecule
Emp. Form.C23H16Cl2F4N2O3
Mol. Mass.515.284
SMILESCN(C(=O)c1c(F)cccc1Cl)c1ccc(cc1OCC(F)(F)F)-c1cc(ccc1Cl)C(N)=O