Reaction Details
TargetPeroxisome proliferator-activated receptor gamma
LigandBDBM50030474
Substrate/Competitorn/a
Meas. Tech.ChEMBL_1508904 (CHEMBL3602054)
EC50 87±n/a nM
Citation Fresno, NMacías-González, MTorres-Zaguirre, ARomero-Cuevas, MSanz-Camacho, PElguero, JPavón, FJRodríguez de Fonseca, FGoya, PPérez-Fernández, R Novel Oxazolidinone-Based Peroxisome Proliferator Activated Receptor Agonists: Molecular Modeling, Synthesis, and Biological Evaluation. J Med Chem58:6639-52 (2015) 
 
Peroxisome proliferator-activated receptor gamma
Name:Peroxisome proliferator-activated receptor gamma
Type:Nuclear Receptor
Mol. Mass.:57613.46
Organism:Homo sapiens (Human)
Description:P37231
Residue:505
BDBM50030474
NameBDBM50030474
Synonyms:Avandamet Avandia CHEBI:50122 US10744117, Compound Rosiglitazone | US9562012, rosiglitazone
TypeSmall organic molecule
Emp. Form.C18H19N3O3S
Mol. Mass.357.427
SMILESCN(CCOc1ccc(CC2SC(=O)NC2=O)cc1)c1ccccn1