Reaction Details
TargetCarbonic anhydrase 1
LigandBDBM50109156
Substrate/Competitorn/a
Meas. Tech.ChEMBL_1508923 (CHEMBL3602142)
Ki 291±n/a nM
Citation Congiu, COnnis, VDeplano, ABalboni, GCeruso, MSupuran, CT Synthesis and carbonic anhydrase I, II, IX and XII inhibitory activity of sulfamates incorporating piperazinyl-ureido moieties. Bioorg Med Chem23:5619-25 (2015) 
 
Carbonic anhydrase 1
Name:Carbonic anhydrase 1
Type:Enzyme
Mol. Mass.:28873.37
Organism:Homo sapiens (Human)
Description:P00915
Residue:261
BDBM50109156
NameBDBM50109156
Synonyms:CHEMBL3601539
TypeSmall organic molecule
Emp. Form.C22H21F3N6O4S
Mol. Mass.522.5
SMILESNS(=O)(=O)Oc1ccc(NC(=O)N2CCN(CC2)c2nccc(n2)-c2ccc(cc2)C(F)(F)F)cc1