Reaction Details
TargetCarbonic anhydrase 2
LigandBDBM50109157
Substrate/Competitorn/a
Meas. Tech.ChEMBL_1508924 (CHEMBL3602143)
Ki 1.2±n/a nM
Citation Congiu, COnnis, VDeplano, ABalboni, GCeruso, MSupuran, CT Synthesis and carbonic anhydrase I, II, IX and XII inhibitory activity of sulfamates incorporating piperazinyl-ureido moieties. Bioorg Med Chem23:5619-25 (2015) 
 
Carbonic anhydrase 2
Name:Carbonic anhydrase 2
Type:Enzyme
Mol. Mass.:29250.71
Organism:Homo sapiens (Human)
Description:P00918
Residue:260
BDBM50109157
NameBDBM50109157
Synonyms:CHEMBL3601538
TypeSmall organic molecule
Emp. Form.C21H21BrN6O4S
Mol. Mass.533.398
SMILESNS(=O)(=O)Oc1ccc(NC(=O)N2CCN(CC2)c2nccc(n2)-c2ccc(Br)cc2)cc1