Reaction Details
TargetCarbonic anhydrase 2
LigandBDBM50109151
Substrate/Competitorn/a
Meas. Tech.ChEMBL_1508924 (CHEMBL3602143)
Ki 5936±n/a nM
Citation Congiu, COnnis, VDeplano, ABalboni, GCeruso, MSupuran, CT Synthesis and carbonic anhydrase I, II, IX and XII inhibitory activity of sulfamates incorporating piperazinyl-ureido moieties. Bioorg Med Chem23:5619-25 (2015) 
 
Carbonic anhydrase 2
Name:Carbonic anhydrase 2
Type:Enzyme
Mol. Mass.:29250.71
Organism:Homo sapiens (Human)
Description:P00918
Residue:260
BDBM50109151
NameBDBM50109151
Synonyms:CHEMBL3601543
TypeSmall organic molecule
Emp. Form.C17H18FN3O2
Mol. Mass.315.3421
SMILESOc1ccc(NC(=O)N2CCN(CC2)c2ccc(F)cc2)cc1