Reaction Details
TargetCarbonic anhydrase 2
LigandBDBM50109149
Substrate/Competitorn/a
Meas. Tech.ChEMBL_1508924 (CHEMBL3602143)
Ki 1428±n/a nM
Citation Congiu, COnnis, VDeplano, ABalboni, GCeruso, MSupuran, CT Synthesis and carbonic anhydrase I, II, IX and XII inhibitory activity of sulfamates incorporating piperazinyl-ureido moieties. Bioorg Med Chem23:5619-25 (2015) 
 
Carbonic anhydrase 2
Name:Carbonic anhydrase 2
Type:Enzyme
Mol. Mass.:29250.71
Organism:Homo sapiens (Human)
Description:P00918
Residue:260
BDBM50109149
NameBDBM50109149
Synonyms:CHEMBL3601545
TypeSmall organic molecule
Emp. Form.C18H21N3O2
Mol. Mass.311.3782
SMILESCc1cccc(c1)N1CCN(CC1)C(=O)Nc1ccc(O)cc1