Reaction Details
TargetCarbonic anhydrase 9
LigandBDBM50109269
Substrate/Competitorn/a
Meas. Tech.ChEMBL_1508925 (CHEMBL3602144)
Ki 34±n/a nM
Citation Congiu, COnnis, VDeplano, ABalboni, GCeruso, MSupuran, CT Synthesis and carbonic anhydrase I, II, IX and XII inhibitory activity of sulfamates incorporating piperazinyl-ureido moieties. Bioorg Med Chem23:5619-25 (2015) 
 
Carbonic anhydrase 9
Name:Carbonic anhydrase 9
Type:Enzyme
Mol. Mass.:49669.03
Organism:Homo sapiens (Human)
Description:Catalytic domain of human cloned isozyme was used in the assay
Residue:459
BDBM50109269
NameBDBM50109269
Synonyms:CHEMBL3601536
TypeSmall organic molecule
Emp. Form.C18H22N4O5S
Mol. Mass.406.456
SMILESCOc1cccc(c1)N1CCN(CC1)C(=O)Nc1ccc(OS(N)(=O)=O)cc1