Reaction Details
TargetNuclear factor erythroid 2-related factor 2
LigandBDBM50109398
Substrate/Competitorn/a
Meas. Tech.ChEMBL_1509259 (CHEMBL3602922)
IC50 3000±n/a nM
Citation Jiang, ZYXu, LLLu, MCChen, ZYYuan, ZWXu, XLGuo, XKZhang, XJSun, HPYou, QD Structure-Activity and Structure-Property Relationship and Exploratory in Vivo Evaluation of the Nanomolar Keap1-Nrf2 Protein-Protein Interaction Inhibitor. J Med Chem58:6410-21 (2015) 
 
Nuclear factor erythroid 2-related factor 2
Name:Nuclear factor erythroid 2-related factor 2
Type:PROTEIN
Mol. Mass.:67786.89
Organism:Homo sapiens (Human)
Description:ChEMBL_107924
Residue:605
BDBM50109398
NameBDBM50109398
Synonyms:CHEMBL2381968
TypeSmall organic molecule
Emp. Form.C26H26N2O5
Mol. Mass.446.495
SMILESOC(=O)[C@H]1CCCC[C@H]1C(=O)N1CCc2ccccc2[C@H]1CN1C(=O)c2ccccc2C1=O