Reaction Details
TargetAmine oxidase [flavin-containing] B
LigandBDBM50172755
Substrate/Competitorn/a
Meas. Tech.ChEMBL_1509992 (CHEMBL3608045)
Ki 0.600000±n/a nM
Citation Carradori, SSilvestri, R New Frontiers in Selective Human MAO-B Inhibitors. J Med Chem58:6717-32 (2015) 
 
Amine oxidase [flavin-containing] B
Name:Amine oxidase [flavin-containing] B
Type:Protein
Mol. Mass.:58768.76
Organism:Homo sapiens (Human)
Description:P27338
Residue:520
BDBM50172755
NameBDBM50172755
Synonyms:1,4-diphenyl-(1E,3E)-1,3-butadiene | CHEMBL198810
TypeSmall organic molecule
Emp. Form.C16H14
Mol. Mass.206.2824
SMILESC(\C=C\c1ccccc1)=C/c1ccccc1