Reaction Details
TargetPolyunsaturated fatty acid lipoxygenase ALOX15
LigandBDBM50109568
Substrate/Competitorn/a
Meas. Tech.ChEMBL_1509999 (CHEMBL3608052)
IC50 24±n/a nM
Citation Pelcman, BSanin, ANilsson, PNo, KSchaal, WÖhrman, SKrog-Jensen, CForsell, PHallberg, ALarhed, MBoesen, TKromann, HVogensen, SBGroth, TClaesson, HE 3-Substituted pyrazoles and 4-substituted triazoles as inhibitors of human 15-lipoxygenase-1. Bioorg Med Chem Lett25:3024-9 (2015) 
 
Polyunsaturated fatty acid lipoxygenase ALOX15
Name:Polyunsaturated fatty acid lipoxygenase ALOX15
Type:Protein
Mol. Mass.:74804.05
Organism:Homo sapiens (Human)
Description:n/a
Residue:662
BDBM50109568
NameBDBM50109568
Synonyms:CHEMBL3604132
TypeSmall organic molecule
Emp. Form.C10H7ClFN3O
Mol. Mass.239.633
SMILESFc1ccc(NC(=O)c2cc[nH]n2)c(Cl)c1