Reaction Details
TargetPolyunsaturated fatty acid lipoxygenase ALOX15
LigandBDBM50109746
Substrate/Competitorn/a
Meas. Tech.ChEMBL_1509997 (CHEMBL3608050)
IC50 20±n/a nM
Citation Pelcman, BSanin, ANilsson, PNo, KSchaal, WÖhrman, SKrog-Jensen, CForsell, PHallberg, ALarhed, MBoesen, TKromann, HVogensen, SBGroth, TClaesson, HE 3-Substituted pyrazoles and 4-substituted triazoles as inhibitors of human 15-lipoxygenase-1. Bioorg Med Chem Lett25:3024-9 (2015) 
 
Polyunsaturated fatty acid lipoxygenase ALOX15
Name:Polyunsaturated fatty acid lipoxygenase ALOX15
Type:Protein
Mol. Mass.:74804.05
Organism:Homo sapiens (Human)
Description:n/a
Residue:662
BDBM50109746
NameBDBM50109746
Synonyms:CHEMBL3604180
TypeSmall organic molecule
Emp. Form.C10H6ClN3O
Mol. Mass.219.627
SMILESClc1ccc2nc(oc2c1)-c1cc[nH]n1