Reaction Details
TargetPolyunsaturated fatty acid 5-lipoxygenase
LigandBDBM50109816
Substrate/Competitorn/a
Meas. Tech.ChEMBL_1510162 (CHEMBL3606533)
IC50>10000±n/a nM
Citation Noha, SMFischer, KKoeberle, AGarscha, UWerz, OSchuster, D Discovery of novel, non-acidic mPGES-1 inhibitors by virtual screening with a multistep protocol. Bioorg Med Chem23:4839-45 (2015) 
 
Polyunsaturated fatty acid 5-lipoxygenase
Name:Polyunsaturated fatty acid 5-lipoxygenase
Type:Enzyme
Mol. Mass.:77972.74
Organism:Homo sapiens (Human)
Description:Recombinant protein was purified from E. coli lysate. After ammonium sulfate precipitation and subsequent steps, the supernatant (S100) was used for 5-LO activity assay.
Residue:674
BDBM50109816
NameBDBM50109816
Synonyms:CHEMBL3604187
TypeSmall organic molecule
Emp. Form.C19H15ClN2O4S2
Mol. Mass.434.916
SMILESCCOc1cc(\C=C2/SC(=S)N(NC(=O)c3ccccc3Cl)C2=O)ccc1O