Reaction Details
TargetProstaglandin G/H synthase 2
LigandBDBM50109816
Substrate/Competitorn/a
Meas. Tech.ChEMBL_1510161 (CHEMBL3606532)
IC50>10000±n/a nM
Citation Noha, SMFischer, KKoeberle, AGarscha, UWerz, OSchuster, D Discovery of novel, non-acidic mPGES-1 inhibitors by virtual screening with a multistep protocol. Bioorg Med Chem23:4839-45 (2015) 
 
Prostaglandin G/H synthase 2
Name:Prostaglandin G/H synthase 2
Type:Enzyme
Mol. Mass.:69003.89
Organism:Homo sapiens (Human)
Description:Recombinant Cox-2 provided by Cayman (Cayman Chemical Co.,Ann Arbor, MI).
Residue:604
BDBM50109816
NameBDBM50109816
Synonyms:CHEMBL3604187
TypeSmall organic molecule
Emp. Form.C19H15ClN2O4S2
Mol. Mass.434.916
SMILESCCOc1cc(\C=C2/SC(=S)N(NC(=O)c3ccccc3Cl)C2=O)ccc1O