Reaction Details
TargetProstaglandin E synthase
LigandBDBM50109818
Substrate/Competitorn/a
Meas. Tech.ChEMBL_1510157 (CHEMBL3606528)
IC50>30000±n/a nM
Citation Noha, SMFischer, KKoeberle, AGarscha, UWerz, OSchuster, D Discovery of novel, non-acidic mPGES-1 inhibitors by virtual screening with a multistep protocol. Bioorg Med Chem23:4839-45 (2015) 
 
Prostaglandin E synthase
Name:Prostaglandin E synthase
Type:Protein
Mol. Mass.:17112.22
Organism:Homo sapiens (Human)
Description:n/a
Residue:152
BDBM50109818
NameBDBM50109818
Synonyms:CHEMBL1288946
TypeSmall organic molecule
Emp. Form.C14H7BrClFN2O
Mol. Mass.353.574
SMILESFc1cccc(Cl)c1-c1noc(n1)-c1ccc(Br)cc1