Reaction Details
TargetProstaglandin E synthase
LigandBDBM50337672
Substrate/Competitorn/a
Meas. Tech.ChEMBL_1510157 (CHEMBL3606528)
IC50>10000±n/a nM
Citation Noha, SMFischer, KKoeberle, AGarscha, UWerz, OSchuster, D Discovery of novel, non-acidic mPGES-1 inhibitors by virtual screening with a multistep protocol. Bioorg Med Chem23:4839-45 (2015) 
 
Prostaglandin E synthase
Name:Prostaglandin E synthase
Type:Protein
Mol. Mass.:17112.22
Organism:Homo sapiens (Human)
Description:n/a
Residue:152
BDBM50337672
NameBDBM50337672
Synonyms:1-benzyl-3-phenyl-1-(3-(phenylethynyl)benzyl)urea | CHEMBL1683218
TypeSmall organic molecule
Emp. Form.C29H24N2O
Mol. Mass.416.5137
SMILESO=C(Nc1ccccc1)N(Cc1ccccc1)Cc1cccc(c1)C#Cc1ccccc1