Reaction Details
TargetProstaglandin E synthase
LigandBDBM50360816
Substrate/Competitorn/a
Meas. Tech.ChEMBL_1510157 (CHEMBL3606528)
IC50 395±n/a nM
Citation Noha, SMFischer, KKoeberle, AGarscha, UWerz, OSchuster, D Discovery of novel, non-acidic mPGES-1 inhibitors by virtual screening with a multistep protocol. Bioorg Med Chem23:4839-45 (2015) 
 
Prostaglandin E synthase
Name:Prostaglandin E synthase
Type:Protein
Mol. Mass.:17112.22
Organism:Homo sapiens (Human)
Description:n/a
Residue:152
BDBM50360816
NameBDBM50360816
Synonyms:CHEMBL1934794
TypeSmall organic molecule
Emp. Form.C17H12BrN3
Mol. Mass.338.201
SMILESCc1ccccc1-c1nc2c(cnc3cc(Br)ccc23)[nH]1