Reaction Details
TargetCyclin-dependent kinase 7
LigandBDBM50110178
Substrate/Competitorn/a
Meas. Tech.ChEMBL_1510322 (CHEMBL3606990)
IC50 3.2±n/a nM
Citation Sánchez-Martínez, CGelbert, LMLallena, MJde Dios, A Cyclin dependent kinase (CDK) inhibitors as anticancer drugs. Bioorg Med Chem Lett25:3420-35 (2015) 
 
Cyclin-dependent kinase 7
Name:Cyclin-dependent kinase 7
Type:Enzyme Subunit
Mol. Mass.:39047.01
Organism:Homo sapiens (Human)
Description:n/a
Residue:346
BDBM50110178
NameBDBM50110178
Synonyms:CHEMBL3603847 | US10787436, Compound I-23
TypeSmall organic molecule
Emp. Form.C31H28ClN7O2
Mol. Mass.566.053
SMILESCN(C)C\C=C\C(=O)Nc1ccc(cc1)C(=O)Nc1cccc(Nc2ncc(Cl)c(n2)-c2c[nH]c3ccccc23)c1