Reaction Details
TargetCarbonic anhydrase 2
LigandBDBM29278
Substrate/Competitorn/a
Meas. Tech.ChEMBL_1511555 (CHEMBL3607055)
Ki 5959±n/a nM
Citation Vullo, DDe Luca, VDel Prete, SCarginale, VScozzafava, ACapasso, CSupuran, CT Sulfonamide inhibition studies of theż-carbonic anhydrase from the Antarctic bacterium Pseudoalteromonas haloplanktis. Bioorg Med Chem Lett25:3550-5 (2015) 
 
Carbonic anhydrase 2
Name:Carbonic anhydrase 2
Type:Enzyme
Mol. Mass.:29250.71
Organism:Homo sapiens (Human)
Description:P00918
Residue:260
BDBM29278
NameBDBM29278
Synonyms:CHEMBL310671 SAC Saccharin
TypeSmall organic molecule
Emp. Form.C7H5NO3S
Mol. Mass.183.185
SMILESO=C1NS(=O)(=O)c2ccccc12