Reaction Details
TargetCarbonic anhydrase 2
LigandBDBM10857
Substrate/Competitorn/a
Meas. Tech.ChEMBL_1511555 (CHEMBL3607055)
Ki 240±n/a nM
Citation Vullo, DDe Luca, VDel Prete, SCarginale, VScozzafava, ACapasso, CSupuran, CT Sulfonamide inhibition studies of theż-carbonic anhydrase from the Antarctic bacterium Pseudoalteromonas haloplanktis. Bioorg Med Chem Lett25:3550-5 (2015) 
 
Carbonic anhydrase 2
Name:Carbonic anhydrase 2
Type:Enzyme
Mol. Mass.:29250.71
Organism:Homo sapiens (Human)
Description:P00918
Residue:260
BDBM10857
NameBDBM10857
Synonyms:4-aminobenzene-1-sulfonamide Sulfanilamide aromatic/heteroaromatic sulfonamide 2 | halogenosulfanilamide deriv. 5a
TypeSmall organic molecule
Emp. Form.C6H8N2O2S
Mol. Mass.172.205
SMILESNc1ccc(cc1)S(N)(=O)=O