Reaction Details
TargetCarbonic anhydrase 2
LigandBDBM10864
Substrate/Competitorn/a
Meas. Tech.ChEMBL_1511555 (CHEMBL3607055)
Ki 40±n/a nM
Citation Vullo, DDe Luca, VDel Prete, SCarginale, VScozzafava, ACapasso, CSupuran, CT Sulfonamide inhibition studies of theż-carbonic anhydrase from the Antarctic bacterium Pseudoalteromonas haloplanktis. Bioorg Med Chem Lett25:3550-5 (2015) 
 
Carbonic anhydrase 2
Name:Carbonic anhydrase 2
Type:Enzyme
Mol. Mass.:29250.71
Organism:Homo sapiens (Human)
Description:P00918
Residue:260
BDBM10864
NameBDBM10864
Synonyms:4-Amino-3-bromobenzenesulfonamide CHEMBL6724 halogenosulfanilamide deriv. 5d
TypeSmall organic molecule
Emp. Form.C6H7BrN2O2S
Mol. Mass.251.101
SMILESNc1ccc(cc1Br)S(N)(=O)=O