Reaction Details
TargetCarbonic anhydrase 2
LigandBDBM81920
Substrate/Competitorn/a
Meas. Tech.ChEMBL_1511555 (CHEMBL3607055)
Ki 80±n/a nM
Citation Vullo, DDe Luca, VDel Prete, SCarginale, VScozzafava, ACapasso, CSupuran, CT Sulfonamide inhibition studies of theż-carbonic anhydrase from the Antarctic bacterium Pseudoalteromonas haloplanktis. Bioorg Med Chem Lett25:3550-5 (2015) 
 
Carbonic anhydrase 2
Name:Carbonic anhydrase 2
Type:Enzyme
Mol. Mass.:29250.71
Organism:Homo sapiens (Human)
Description:P00918
Residue:260
BDBM81920
NameBDBM81920
Synonyms:p-Hydroxy-benzene derivative, 3a
TypeSmall organic molecule
Emp. Form.C6H7NO3S
Mol. Mass.173.19
SMILESNS(=O)(=O)c1ccc(O)cc1