Reaction Details
TargetCarbonic anhydrase 2
LigandBDBM50080733
Substrate/Competitorn/a
Meas. Tech.ChEMBL_1511555 (CHEMBL3607055)
Ki 46±n/a nM
Citation Vullo, DDe Luca, VDel Prete, SCarginale, VScozzafava, ACapasso, CSupuran, CT Sulfonamide inhibition studies of theż-carbonic anhydrase from the Antarctic bacterium Pseudoalteromonas haloplanktis. Bioorg Med Chem Lett25:3550-5 (2015) 
 
Carbonic anhydrase 2
Name:Carbonic anhydrase 2
Type:Enzyme
Mol. Mass.:29250.71
Organism:Homo sapiens (Human)
Description:P00918
Residue:260
BDBM50080733
NameBDBM50080733
Synonyms:4-(4-aminophenylsulfonamido)-1-benzenesulfonamide 4-amino-N-[4-(aminosulfonyl)phenyl]benzenesulfonamide CHEMBL269122 | cid_68351
TypeSmall organic molecule
Emp. Form.C12H13N3O4S2
Mol. Mass.327.379
SMILESNc1ccc(cc1)S(=O)(=O)Nc1ccc(cc1)S(N)(=O)=O