Reaction Details
TargetCarbonic anhydrase 2
LigandBDBM10882
Substrate/Competitorn/a
Meas. Tech.ChEMBL_1511555 (CHEMBL3607055)
Ki 8.0±n/a nM
Citation Vullo, DDe Luca, VDel Prete, SCarginale, VScozzafava, ACapasso, CSupuran, CT Sulfonamide inhibition studies of theż-carbonic anhydrase from the Antarctic bacterium Pseudoalteromonas haloplanktis. Bioorg Med Chem Lett25:3550-5 (2015) 
 
Carbonic anhydrase 2
Name:Carbonic anhydrase 2
Type:Enzyme
Mol. Mass.:29250.71
Organism:Homo sapiens (Human)
Description:P00918
Residue:260
BDBM10882
NameBDBM10882
Synonyms:6-ethoxy-1,3-benzothiazole-2-sulfonamide Ethamide Ethoxzolamide Ethoxzolamide, EZM US10172837, Ethoxyzolamide | sulfonamide 3
TypeSmall organic molecule
Emp. Form.C9H10N2O3S2
Mol. Mass.258.317
SMILESCCOc1ccc2nc(sc2c1)S(N)(=O)=O