Reaction Details
TargetSomatostatin receptor type 3
LigandBDBM50110466
Substrate/Competitorn/a
Meas. Tech.ChEMBL_1510034 (CHEMBL3606126)
Ki 24±n/a nM
Citation Lai, ZHe, SSherer, ECWu, ZYu, YBall, RHong, QYang, DXGuo, LLi, DTuang, QChicchi, GGTrusca, DTsao, KLZhou, YPHoward, ADNargund, RPHagmann, WK Discovery of substituted (4-phenyl-1H-imidazol-2-yl)methanamine as potent somatostatin receptor 3 agonists. Bioorg Med Chem Lett25:3520-5 (2015) 
 
Somatostatin receptor type 3
Name:Somatostatin receptor type 3
Type:Protein
Mol. Mass.:45855.97
Organism:Homo sapiens (Human)
Description:P32745
Residue:418
BDBM50110466
NameBDBM50110466
Synonyms:CHEMBL3605794
TypeSmall organic molecule
Emp. Form.C25H28N4O
Mol. Mass.400.516
SMILESCOc1cccc2c(CNC3(CCCC3)c3nc(c[nH]3)-c3ccc(C)cc3)c[nH]c12