Reaction Details
TargetSomatostatin receptor type 3
LigandBDBM50110474
Substrate/Competitorn/a
Meas. Tech.ChEMBL_1510034 (CHEMBL3606126)
Ki 32±n/a nM
Citation Lai, ZHe, SSherer, ECWu, ZYu, YBall, RHong, QYang, DXGuo, LLi, DTuang, QChicchi, GGTrusca, DTsao, KLZhou, YPHoward, ADNargund, RPHagmann, WK Discovery of substituted (4-phenyl-1H-imidazol-2-yl)methanamine as potent somatostatin receptor 3 agonists. Bioorg Med Chem Lett25:3520-5 (2015) 
 
Somatostatin receptor type 3
Name:Somatostatin receptor type 3
Type:Protein
Mol. Mass.:45855.97
Organism:Homo sapiens (Human)
Description:P32745
Residue:418
BDBM50110474
NameBDBM50110474
Synonyms:CHEMBL3605802
TypeSmall organic molecule
Emp. Form.C23H27N3O
Mol. Mass.361.48
SMILESCOc1ccc(CNC2(CCCC2)c2nc(c[nH]2)-c2ccc(C)cc2)cc1