Reaction Details
TargetGlucocorticoid receptor
LigandBDBM50110731
Substrate/Competitorn/a
Meas. Tech.ChEMBL_1510389 (CHEMBL3607229)
IC50 14±n/a nM
Citation Luz, JGCarson, MWCondon, BClawson, DPustilnik, AKohlman, DTBarr, RJBean, JSDill, MJSindelar, DKMaletic, MCoghlan, MJ Indole Glucocorticoid Receptor Antagonists Active in a Model of Dyslipidemia Act via a Unique Association with an Agonist Binding Site. J Med Chem58:6607-18 (2015) 
 
Glucocorticoid receptor
Name:Glucocorticoid receptor
Type:Enzyme Catalytic Domain
Mol. Mass.:87556.83
Organism:RAT
Description:Glucocorticoid 0 RAT::P06536
Residue:795
BDBM50110731
NameBDBM50110731
Synonyms:CHEMBL3605926
TypeSmall organic molecule
Emp. Form.C29H34FN3O3S
Mol. Mass.523.662
SMILESCOc1cc(F)ccc1-c1c(CN(C)Cc2ccccc2)[nH]c2c(NS(C)(=O)=O)cc(cc12)C(C)(C)C