Reaction Details
TargetAndrogen receptor
LigandBDBM50110735
Substrate/Competitorn/a
Meas. Tech.ChEMBL_1510385 (CHEMBL3607225)
Ki 91±n/a nM
Citation Luz, JGCarson, MWCondon, BClawson, DPustilnik, AKohlman, DTBarr, RJBean, JSDill, MJSindelar, DKMaletic, MCoghlan, MJ Indole Glucocorticoid Receptor Antagonists Active in a Model of Dyslipidemia Act via a Unique Association with an Agonist Binding Site. J Med Chem58:6607-18 (2015) 
 
Androgen receptor
Name:Androgen receptor
Type:Receptor
Mol. Mass.:99185.27
Organism:Homo sapiens (Human)
Description:CHO cells were stably transfected with human AR gene.
Residue:920
BDBM50110735
NameBDBM50110735
Synonyms:CHEMBL3605932
TypeSmall organic molecule
Emp. Form.C15H13ClN2O2S
Mol. Mass.320.794
SMILESCS(=O)(=O)Nc1cccc2c(c[nH]c12)-c1cccc(Cl)c1