Reaction Details
TargetCannabinoid receptor 2
LigandBDBM50111522
Substrate/Competitorn/a
Meas. Tech.ChEMBL_1510270 (CHEMBL3606866)
EC50>5000±n/a nM
Citation Presley, CSMustafa, SMAbidi, AHMoore, BM Synthesis and biological evaluation of (3',5'-dichloro-2,6-dihydroxy-biphenyl-4-yl)-aryl/alkyl-methanone selective CB2 inverse agonist. Bioorg Med Chem23:5390-401 (2015) 
 
Cannabinoid receptor 2
Name:Cannabinoid receptor 2
Type:G Protein-Coupled Receptor (GPCR)
Mol. Mass.:39690.94
Organism:Homo sapiens (Human)
Description:P34972
Residue:360
BDBM50111522
NameBDBM50111522
Synonyms:CHEMBL3605041
TypeSmall organic molecule
Emp. Form.C21H16Cl2O3
Mol. Mass.387.256
SMILESCCc1cccc(c1)C(=O)c1cc(O)c(c(O)c1)-c1cc(Cl)cc(Cl)c1