Reaction Details
TargetCannabinoid receptor 1
LigandBDBM50111546
Substrate/Competitorn/a
Meas. Tech.ChEMBL_1510265 (CHEMBL3606861)
Ki>10000±n/a nM
Citation Presley, CSMustafa, SMAbidi, AHMoore, BM Synthesis and biological evaluation of (3',5'-dichloro-2,6-dihydroxy-biphenyl-4-yl)-aryl/alkyl-methanone selective CB2 inverse agonist. Bioorg Med Chem23:5390-401 (2015) 
 
Cannabinoid receptor 1
Name:Cannabinoid receptor 1
Type:G Protein-Coupled Receptor (GPCR)
Mol. Mass.:52868.96
Organism:Homo sapiens (Human)
Description:P21554
Residue:472
BDBM50111546
NameBDBM50111546
Synonyms:CHEMBL3605053
TypeSmall organic molecule
Emp. Form.C21H15Cl3O3
Mol. Mass.421.701
SMILESCOc1cc(cc(OC)c1-c1cc(Cl)cc(Cl)c1)C(=O)c1ccc(Cl)cc1