Reaction Details
TargetCannabinoid receptor 1
LigandBDBM50111513
Substrate/Competitorn/a
Meas. Tech.ChEMBL_1510268 (CHEMBL3606864)
EC50 3280±n/a nM
Citation Presley, CSMustafa, SMAbidi, AHMoore, BM Synthesis and biological evaluation of (3',5'-dichloro-2,6-dihydroxy-biphenyl-4-yl)-aryl/alkyl-methanone selective CB2 inverse agonist. Bioorg Med Chem23:5390-401 (2015) 
 
Cannabinoid receptor 1
Name:Cannabinoid receptor 1
Type:G Protein-Coupled Receptor (GPCR)
Mol. Mass.:52868.96
Organism:Homo sapiens (Human)
Description:P21554
Residue:472
BDBM50111513
NameBDBM50111513
Synonyms:CHEMBL3605047
TypeSmall organic molecule
Emp. Form.C19H11Cl3O3
Mol. Mass.393.648
SMILESOc1cc(cc(O)c1-c1cc(Cl)cc(Cl)c1)C(=O)c1ccc(Cl)cc1