Reaction Details
TargetMuscarinic acetylcholine receptor M1
LigandBDBM50112159
Substrate/Competitorn/a
Meas. Tech.ChEMBL_1512945 (CHEMBL3609984)
EC50 48±n/a nM
Citation Blass, B Pyrrolopyridine or Pyrazolopyridine Derivatives. ACS Med Chem Lett6:726-8 (2015) 
 
Muscarinic acetylcholine receptor M1
Name:Muscarinic acetylcholine receptor M1
Type:Protein
Mol. Mass.:51442.54
Organism:Homo sapiens (Human)
Description:P11229
Residue:460
BDBM50112159
NameBDBM50112159
Synonyms:CHEMBL3608416
TypeSmall organic molecule
Emp. Form.C25H26FN5O3
Mol. Mass.463.504
SMILESCn1cc(cn1)-c1ccc(Cn2cc(C(=O)N[C@H]3CCOC[C@@]3(C)O)c3ncccc23)c(F)c1