Reaction Details
TargetMuscarinic acetylcholine receptor M1
LigandBDBM50112158
Substrate/Competitorn/a
Meas. Tech.ChEMBL_1512946 (CHEMBL3609985)
EC50 51±n/a nM
Citation Blass, B Pyrrolopyridine or Pyrazolopyridine Derivatives. ACS Med Chem Lett6:726-8 (2015) 
 
Muscarinic acetylcholine receptor M1
Name:Muscarinic acetylcholine receptor M1
Type:Enzyme Catalytic Domain
Mol. Mass.:51390.46
Organism:RAT
Description:P08482
Residue:460
BDBM50112158
NameBDBM50112158
Synonyms:CHEMBL3608417
TypeSmall organic molecule
Emp. Form.C24H24FN5O3
Mol. Mass.449.4775
SMILESCn1cc(cn1)-c1ccc(Cn2cc(C(=O)N[C@H]3COCC[C@@H]3O)c3ncccc23)c(F)c1