Reaction Details
TargetMuscarinic acetylcholine receptor M1
LigandBDBM50112157
Substrate/Competitorn/a
Meas. Tech.ChEMBL_1512946 (CHEMBL3609985)
EC50 163±n/a nM
Citation Blass, B Pyrrolopyridine or Pyrazolopyridine Derivatives. ACS Med Chem Lett6:726-8 (2015) 
 
Muscarinic acetylcholine receptor M1
Name:Muscarinic acetylcholine receptor M1
Type:Enzyme Catalytic Domain
Mol. Mass.:51390.46
Organism:RAT
Description:P08482
Residue:460
BDBM50112157
NameBDBM50112157
Synonyms:CHEMBL3608418
TypeSmall organic molecule
Emp. Form.C22H23N5O3
Mol. Mass.405.4497
SMILESCn1ncc2cc(Cn3cc(C(=O)N[C@H]4COCC[C@@H]4O)c4ncccc34)ccc12