Reaction Details
TargetCytochrome P450 1A1
LigandBDBM50432672
Substrate/Competitorn/a
Meas. Tech.ChEMBL_1508786 (CHEMBL3603195)
Ki 110±n/a nM
Citation Liu, JPham, PTSkripnikova, EVZheng, SLovings, LJWang, YGoyal, NBellow, SMMensah, LMChatters, AJBratton, MRWiese, TEZhao, MWang, GForoozesh, M A Ligand-Based Drug Design. Discovery of 4-Trifluoromethyl-7,8-pyranocoumarin as a Selective Inhibitor of Human Cytochrome P450 1A2. J Med Chem58:6481-93 (2015) 
 
Cytochrome P450 1A1
Name:Cytochrome P450 1A1
Type:Protein
Mol. Mass.:58177.23
Organism:Homo sapiens (Human)
Description:P04798
Residue:512
BDBM50432672
NameBDBM50432672
Synonyms:CHEMBL2347912
TypeSmall organic molecule
Emp. Form.C18H12O4
Mol. Mass.292.2855
SMILESOc1cc2OCC=Cc2c2oc(cc(=O)c12)-c1ccccc1