Reaction Details
TargetCytochrome P450 1A2
LigandBDBM50113261
Substrate/Competitorn/a
Meas. Tech.ChEMBL_1508787 (CHEMBL3603196)
Ki 76±n/a nM
Citation Liu, JPham, PTSkripnikova, EVZheng, SLovings, LJWang, YGoyal, NBellow, SMMensah, LMChatters, AJBratton, MRWiese, TEZhao, MWang, GForoozesh, M A Ligand-Based Drug Design. Discovery of 4-Trifluoromethyl-7,8-pyranocoumarin as a Selective Inhibitor of Human Cytochrome P450 1A2. J Med Chem58:6481-93 (2015) 
 
Cytochrome P450 1A2
Name:Cytochrome P450 1A2
Type:Enzyme
Mol. Mass.:58423.38
Organism:Homo sapiens (Human)
Description:P05177
Residue:516
BDBM50113261
NameBDBM50113261
Synonyms:CHEMBL3601435
TypeSmall organic molecule
Emp. Form.C18H11NO2
Mol. Mass.273.2854
SMILESO=c1cc(oc2c3cccnc3ccc12)-c1ccccc1