Reaction Details
TargetCytochrome P450 1A2
LigandBDBM50113273
Substrate/Competitorn/a
Meas. Tech.ChEMBL_1508787 (CHEMBL3603196)
Ki 1350±n/a nM
Citation Liu, JPham, PTSkripnikova, EVZheng, SLovings, LJWang, YGoyal, NBellow, SMMensah, LMChatters, AJBratton, MRWiese, TEZhao, MWang, GForoozesh, M A Ligand-Based Drug Design. Discovery of 4-Trifluoromethyl-7,8-pyranocoumarin as a Selective Inhibitor of Human Cytochrome P450 1A2. J Med Chem58:6481-93 (2015) 
 
Cytochrome P450 1A2
Name:Cytochrome P450 1A2
Type:Enzyme
Mol. Mass.:58423.38
Organism:Homo sapiens (Human)
Description:P05177
Residue:516
BDBM50113273
NameBDBM50113273
Synonyms:CHEMBL3601509
TypeSmall organic molecule
Emp. Form.C13H7F3O3
Mol. Mass.268.1881
SMILESCc1cc2c(ccc3c(cc(=O)oc23)C(F)(F)F)o1