Reaction Details
TargetCytochrome P450 2D6
LigandBDBM50113476
Substrate/Competitorn/a
Meas. Tech.ChEMBL_1510829 (CHEMBL3606593)
IC50<15849±n/a nM
Citation Christopher, JAAves, SJBennett, KADoré, ASErrey, JCJazayeri, AMarshall, FHOkrasa, KSerrano-Vega, MJTehan, BGWiggin, GRCongreve, M Fragment and Structure-Based Drug Discovery for a Class C GPCR: Discovery of the mGlu5 Negative Allosteric Modulator HTL14242 (3-Chloro-5-[6-(5-fluoropyridin-2-yl)pyrimidin-4-yl]benzonitrile). J Med Chem58:6653-64 (2015) 
 
Cytochrome P450 2D6
Name:Cytochrome P450 2D6
Type:Protein
Mol. Mass.:55774.82
Organism:Homo sapiens (Human)
Description:P10635
Residue:497
BDBM50113476
NameBDBM50113476
Synonyms:CHEMBL3603923 US10584111, Ex No. 17 | US11584732, Example 17
TypeSmall organic molecule
Emp. Form.C16H8ClFN4
Mol. Mass.310.713
SMILESFc1ccc(nc1)-c1cc(ncn1)-c1cc(Cl)cc(c1)C#N