Reaction Details
TargetMetabotropic glutamate receptor 5
LigandBDBM50113479
Substrate/Competitorn/a
Meas. Tech.ChEMBL_1510802 (CHEMBL3606566)
Ki 0.794328±n/a nM
Citation Christopher, JAAves, SJBennett, KADoré, ASErrey, JCJazayeri, AMarshall, FHOkrasa, KSerrano-Vega, MJTehan, BGWiggin, GRCongreve, M Fragment and Structure-Based Drug Discovery for a Class C GPCR: Discovery of the mGlu5 Negative Allosteric Modulator HTL14242 (3-Chloro-5-[6-(5-fluoropyridin-2-yl)pyrimidin-4-yl]benzonitrile). J Med Chem58:6653-64 (2015) 
 
Metabotropic glutamate receptor 5
Name:Metabotropic glutamate receptor 5
Type:Enzyme
Mol. Mass.:132484.72
Organism:Homo sapiens (Human)
Description:n/a
Residue:1212
BDBM50113479
NameBDBM50113479
Synonyms:CHEMBL3603926 US10584111, Ex No. 22 | US11584732, Example 22
TypeSmall organic molecule
Emp. Form.C16H7ClF2N4
Mol. Mass.328.703
SMILESFc1ccc(nc1)-c1cc(ncn1)-c1cc(cc(Cl)c1F)C#N