Reaction Details
TargetMetabotropic glutamate receptor 5
LigandBDBM50113466
Substrate/Competitorn/a
Meas. Tech.ChEMBL_1510802 (CHEMBL3606566)
Ki 4.0±n/a nM
Citation Christopher, JAAves, SJBennett, KADoré, ASErrey, JCJazayeri, AMarshall, FHOkrasa, KSerrano-Vega, MJTehan, BGWiggin, GRCongreve, M Fragment and Structure-Based Drug Discovery for a Class C GPCR: Discovery of the mGlu5 Negative Allosteric Modulator HTL14242 (3-Chloro-5-[6-(5-fluoropyridin-2-yl)pyrimidin-4-yl]benzonitrile). J Med Chem58:6653-64 (2015) 
 
Metabotropic glutamate receptor 5
Name:Metabotropic glutamate receptor 5
Type:Enzyme
Mol. Mass.:132484.72
Organism:Homo sapiens (Human)
Description:n/a
Residue:1212
BDBM50113466
NameBDBM50113466
Synonyms:CHEMBL3603913 US10584111, Ex No. 13 | US11584732, Example 13
TypeSmall organic molecule
Emp. Form.C15H11N5
Mol. Mass.261.2813
SMILESCc1cc(cc(c1)-c1cc(ncn1)-n1cccn1)C#N